sagotering
type: Concept
alternative label: saduttaminen @fi
alternative label: barns sagoberättande
broader: konstnärligt skapande
in scheme: conceptscheme
preferred label: sadutus @fi
preferred label: storycrafting method @en
scope note: En metod där barn får berätta för vuxna och de vuxna lyssnar och antecknar utan att lägga sig i och föreslå. Texten läses sedan högt och berättaren kan göra ändringar.
scope note: Lapsen tai lapsiryhmän kertoessa tarinaa aikuinen kirjoittaa sen muistiin sellaisenaan. Sen jälkeen tarina luetaan kertojalle, jotta tämä voi tehdä siihen korjauksia. Tällä tavalla kerätään lasten ajatuksia ja kertomuksia

konstnärligt skapande
type: Concept
narrower: sagotering
preferred label: artistic creation @en
preferred label: taiteellinen luonti @fi