kiintoaines
type: Concept

aine
type: Concept
narrower: kiintoaines
preferred label: matter @en
preferred label: materia @sv

kiintoaines
type: Concept
source: Aaltojen alla -sanasto
comment: veden mukana kulkevia, osin liuenneita kiinteiden aineiden hiukkasia, se voi olla epäorgaanista kivennäisainesta tai orgaanista ainetta
alternative label: solid matter @en
broader: aine
in scheme: conceptscheme
preferred label: solids @en
preferred label: sediment (suspenderat material) @sv