syrisk-ortodoxa kyrkan
type: Concept
alternative label: jakobiter (kyrkosamfund)
alternative label: West Syrian Rite @en
broader: religiösa samfund
in scheme: conceptscheme
preferred label: Jacobites @en
preferred label: jakobiitit @fi
scope note: Perustajansa Jakob Baradaeuksen mukaan nimensä saanut monofysiittinen kirkkokunta.Nykyisin jakobiittejä on lähinnä Syyriassa ja Irakissa

religiösa samfund
type: Concept
narrower: syrisk-ortodoxa kyrkan
preferred label: religious communities @en
preferred label: uskonnolliset yhteisöt @fi