hälsovårdsläroinrättningar
type: Concept
broader: yrkesinriktade läroanstalter
scope note: Benämningen används sedan år 1987, tidigare se termen sjukvårdsläroanstalter
scope note: Nimitys käytössä vuodesta 1987 lähtien, aiemmat katso sairaanhoito-oppilaitokset
related: sjukvårdsläroanstalter
in scheme: conceptscheme
preferred label: health service colleges @en
preferred label: terveydenhuolto-oppilaitokset @fi

yrkesinriktade läroanstalter
type: Concept
preferred label: occupational schools @en
preferred label: ammatilliset oppilaitokset @fi
narrower: hälsovårdsläroinrättningar

sjukvårdsläroanstalter
type: Concept
preferred label: nursing schools @en
preferred label: sairaanhoito-oppilaitokset @fi
related: hälsovårdsläroinrättningar