nationallitteratur
type: Concept
broader: kulturella alster
source: Kielitoimiston sanakirja
comment: se osa kansan kirjallisuutta, jossa kansan ominaispiirteet selvimmin ilmenevät
in scheme: conceptscheme
preferred label: national literature @en
preferred label: kansalliskirjallisuus @fi

kulturella alster
type: Concept
preferred label: cultural accomplishments @en
preferred label: kulttuuriset tuotokset @fi
narrower: nationallitteratur