role related to action
preferred label: sysselsättningsrelaterad roll @sv
preferred label: toimintaan liittyvä rooli @fi
type: Concept
narrower: beatniks

beatniks
broader: role related to action
source: Kielitoimiston sanakirja
comment: Yhdysvalloissa 1950-luvun ns. pettyneestä eli beat-sukupolvesta, joka kapinoi sovinnaisuutta vastaan
in scheme: conceptscheme
preferred label: beatnikit @fi
preferred label: beatnikar @sv
type: Concept