lokalhistoriker
preferred label: paikallishistoriat (historiikit) @fi
preferred label: local histories @en
type: Concept
related: lokalhistoria

lokalhistoria
broader: historia
scope note: Betecknar ett delområde inom historieforskningen.
scope note: Tarkoittaa historiantutkimuksen osa-aluetta. Käytä alueellisista historiikeista termiä paikallishistoriat
related: lokalhistoriker
in scheme: conceptscheme
preferred label: paikallishistoria (erikoisala) @fi
preferred label: local history @en
type: Concept

historia
preferred label: history @en
type: Concept
narrower: lokalhistoria