Koulutus, tiede ja kulttuuri
type: Collection
member: Koulu, koulutus- ja kulttuuripolitiikka
preferred label: Utbildning, vetenskap och kultur @sv
preferred label: Education, science and culture @en

Koulu, koulutus- ja kulttuuripolitiikka
type: Collection
member: Aalto-yliopisto
notation: 38.01
preferred label: Skol, utbildnings- och kulturpolitik @sv
preferred label: School policy, educational and cultural policy @en

Aalto-yliopisto
type: Concept
is member of: Koulu, koulutus- ja kulttuuripolitiikka
type: eksuu10
date: 2010-02-25
preferred label: Aalto-universitet @sv
preferred label: Aalto University @en
related: korkeakoulut
scope note: Helsingin teknillinen korkeakoulu, Helsingin kauppakorkeakoulu ja Taideteollinen korkeakoulu yhdistyivät Aalto-yliopistoksi 1.1.2010

korkeakoulut
type: Concept
preferred label: högskolor @sv