Historia
type: Collection
member: Finlands historia
preferred label: History @en

Finlands historia
type: Collection
member: Självständighetens tid
preferred label: Suomen historia @fi
preferred label: History of Finland @en

Självständighetens tid
type: Collection
member: äktfinskhet
notation: 43.02.02
preferred label: Itsenäisyyden aika @fi
preferred label: Period of Finnish independence @en

äktfinskhet
type: Concept
is member of: Självständighetens tid
source: kir
date: 1990-01-02
preferred label: aitosuomalaisuus @fi
preferred label: Fenno-nationalism @en
related: nationalism
scope note: Käytetään historiallisessa merkityksessä @fi
scope note: Used in a historical sense @en

nationalism
type: Concept
preferred label: nationalismi @fi