Siviilioikeus
type: Collection
member: Esineoikeus
preferred label: Civilrätt @sv
preferred label: Civil law @en

Esineoikeus
type: Collection
member: laina
notation: 14.04
preferred label: Sakrätt @sv
preferred label: Law of property @en

laina
type: Concept
is member of: Esineoikeus
source: muo
type: ps
date: 1992-01-23
preferred label: lån @sv
preferred label: loan @en
scope note: Irtaimen esineen vastikkeeton luovutus käytettäväksi