Maa-, vesi- ja ympäristöoikeus
type: Collection
member: Ympäristönsuojelulainsäädäntö
preferred label: Jord-, vatten- och miljörätt @sv
preferred label: Land-, water- and environmental law @en

Ympäristönsuojelulainsäädäntö
type: Collection
member: lajiensuojelu
notation: 16.06
preferred label: Miljöskyddslagstiftning @sv
preferred label: Environmental legislation @en

Ympäristö, aluesuunnittelu, asuminen
type: Collection
member: Ympäristönsuojelu, luonnonsuojelu
preferred label: Miljö, regionsplanering, boende @sv
preferred label: Environment, regional planning, housing @en

Ympäristönsuojelu, luonnonsuojelu
type: Collection
member: lajiensuojelu
notation: 42.01
preferred label: Miljöskydd, naturvård @sv
preferred label: Environmental protection, protection of nature @en

lajiensuojelu
type: Concept
is member of: Ympäristönsuojelu, luonnonsuojelu
is member of: Ympäristönsuojelulainsäädäntö
type: ps3
date: 1994-11-18
preferred label: skydd för djur- och växtarter @sv
preferred label: conservation of species of wild fauna and flora @en
related: ympäristönsuojelu
scope note: Käytetään merkityksessä eläin- ja kasvilajien suojelu

ympäristönsuojelu
type: Concept
preferred label: miljöskydd @sv
preferred label: environmental protection @en