Internationell privaträtt
type: Collection
member: Internationell privaträtt, allmänt
preferred label: Kansainvälinen yksityisoikeus @fi
preferred label: Private international law @en

Internationell privaträtt, allmänt
type: Collection
member: ordre public
notation: 25.01
preferred label: Kansainvälinen yksityisoikeus, yleistä @fi

ordre public
type: Concept
is member of: Internationell privaträtt, allmänt
source: muo
type: ps
date: 1992-02-13
scope note: Oikeusjärjestyksen perusteiden vastaisen vieraan normin soveltamiskielto @fi