Euroopan unioin oikeus
type: Collection
member: ryhmäpoikkeukset
notation: 26
preferred label: Europeiska unionens rätt @sv
preferred label: Law of the European Union @en
preferred label: Euroopan unionin oikeus

Euroopan unioni
type: Collection
member: ryhmäpoikkeukset
notation: 31
preferred label: Europeiska unionen @sv
preferred label: European Union @en

ryhmäpoikkeukset
type: Concept
is member of: Euroopan unioin oikeus
is member of: Euroopan unioni
type: ey
type: ps3
date: 1993-06-14
alternative label: group exemptions @en
alternative label: block exemptions @en
alternative label: Group exemptions @en
preferred label: gruppundantag @sv
preferred label: Gruppenfreistellungen @de
scope note: EU-asetuksella sallitut poikkeukset kilpailunrajoituksiin