Oikeustiede yleensä, oikeusfilosofia, oikeussosiologia, oikeuspolitiikka ja vertaileva oikeustiede
type: Collection
member: trust
notation: 11

trust
type: Concept
is member of: Oikeustiede yleensä, oikeusfilosofia, oikeussosiologia, oikeuspolitiikka ja vertaileva oikeustiede
source: muo
type: ps
date: 1992-02-13
note: Selitystä muutettu 28.10.93
scope note: käytetään common law-järjestelmään liittyvänä terminä