Prosessioikeus
type: Collection
member: Todistusoikeus
preferred label: Processrätt @sv
preferred label: Procedural law @en

Todistusoikeus
type: Collection
member: tunnustus
notation: 19.04
preferred label: Bevisrätt @sv
preferred label: Law of evidence @en

tunnustus
type: Concept
is member of: Todistusoikeus
source: muo
type: ps
date: 1992-01-23
preferred label: bekännelse @sv
preferred label: confession @en
scope note: Käytetään todistusoikeudellisessa merkityksessä