EY-direktiivi
type: Concept
preferred label: EG-direktiv @sv
preferred label: CE directive @fr
preferred label: EC directive @en
preferred label: EG Richtlinie @de
preferred label: EF direktiv @da

EU-direktiivi
type: Concept
scope note: Nimi tuli käyttöön Lissabonin sopimuksen astuttua voimaan 1.12.2009
is member of: Euroopan unioin oikeus
is member of: Euroopan unioni
type: eksuu10
related: EY-direktiivi
date: 2010-03-05
preferred label: EU direktiv @sv
preferred label: EU directive @en

Euroopan unioin oikeus
type: Collection
notation: 26
preferred label: Europeiska unionens rätt @sv
preferred label: Law of the European Union @en
preferred label: Euroopan unionin oikeus
member: EU-direktiivi

Euroopan unioni
type: Collection
notation: 31
preferred label: Europeiska unionen @sv
preferred label: European Union @en
member: EU-direktiivi