euroalue
type: Concept
scope note: euroalueen muodostavat Euroopan talous- ja rahaliittoon kuuluvat maat
is member of: Euroopan unioni
type: eks05u
date: 2005-05-12
preferred label: euroområdet @sv
preferred label: euro area @en

Euroopan unioni
type: Collection
notation: 31
preferred label: Europeiska unionen @sv
preferred label: European Union @en
member: euroalue