kadettikoulut
type: Concept
modified: 2010-06-22
note: Yhdistetty Maanpuolustuskorkeakoulu-termiin
source: kir
scope note: yhdistyi Maanpuolustuskorkeakouluun vuonna 1993
is member of: Maanpuolustus
date: 1990-01-04
preferred label: kadettskolor @sv
preferred label: military academies @en

Maanpuolustus
type: Collection
notation: 37
preferred label: Försvar @sv
preferred label: National defence @en
member: kadettikoulut