kokoelmatyö
type: Concept
note: Aineiston hankinta, inventointi, karsinta.
source: kinf
scope note: Kirjaston kokoelmien luominen ja kehittäminen
is member of: Kirjastot
date: 1992-06-17
preferred label: beståndsutveckling @sv
preferred label: collection development (library term) @en

Kirjastot
type: Collection
notation: 45
preferred label: Bibliotek @sv
preferred label: Libraries @en
member: kokoelmatyö