ympäristönsuojelu
type: Concept
preferred label: miljöskydd @sv
preferred label: environmental protection @en

lajiensuojelu
type: Concept
scope note: Käytetään merkityksessä eläin- ja kasvilajien suojelu
is member of: Ympäristönsuojelu, luonnonsuojelu
is member of: Ympäristönsuojelulainsäädäntö
type: ps3
related: ympäristönsuojelu
date: 1994-11-18
preferred label: skydd för djur- och växtarter @sv
preferred label: conservation of species of wild fauna and flora @en

Ympäristö, aluesuunnittelu, asuminen
type: Collection
preferred label: Miljö, regionsplanering, boende @sv
preferred label: Environment, regional planning, housing @en
member: Ympäristönsuojelu, luonnonsuojelu

Maa-, vesi- ja ympäristöoikeus
type: Collection
preferred label: Jord-, vatten- och miljörätt @sv
preferred label: Land-, water- and environmental law @en
member: Ympäristönsuojelulainsäädäntö

Ympäristönsuojelu, luonnonsuojelu
type: Collection
notation: 42.01
preferred label: Miljöskydd, naturvård @sv
preferred label: Environmental protection, protection of nature @en
member: lajiensuojelu

Ympäristönsuojelulainsäädäntö
type: Collection
notation: 16.06
preferred label: Miljöskyddslagstiftning @sv
preferred label: Environmental legislation @en
member: lajiensuojelu