maksamismääräys
type: Concept
scope note: tarkoitetaan myös eurooppalaista menettelyä
is member of: Riita-asiain oikeudenkäynti
type: eksuu08
date: 2008-11-25
preferred label: betalningsföreläggande @sv
preferred label: order for payment procedure @en

Prosessioikeus
type: Collection
preferred label: Processrätt @sv
preferred label: Procedural law @en
member: Riita-asiain oikeudenkäynti

Riita-asiain oikeudenkäynti
type: Collection
notation: 19.03
preferred label: Rättegången i tvistemål @sv
preferred label: Civil procedure @en
member: maksamismääräys