Burma
type: Concept
preferred label: Birmanie @fr
preferred label: Myanmar @de

Myanmar
type: Concept
scope note: Myanmar vuodesta 1990.Aiemmin Burma. @fi
is member of: Stater
type: eksuu01
related: Burma
date: 2001-12-17

Stater, geografiska områden
type: Collection
preferred label: Valtiot, maantieteelliset alueet @fi
preferred label: States, geographical regions @en
member: Stater

Stater
type: Collection
notation: 48.01
preferred label: Valtiot @fi
preferred label: States @en
member: Myanmar