seulontamenettely
type: Concept
scope note: hovioikeus päättää ensin otetaanko valitus enempään tutkintaan.Seulontamenettely on korvattu vuoden 2011 alusta jatkokäsittelymenettelyllä.
is member of: Muutoksenhakukeinot
type: eksuu04
date: 2004-12-15
preferred label: sållningsförfarande @sv
preferred label: screening procedure @en

Prosessioikeus
type: Collection
preferred label: Processrätt @sv
preferred label: Procedural law @en
member: Muutoksenhakukeinot

Muutoksenhakukeinot
type: Collection
notation: 19.10
preferred label: Rättsmedel @sv
member: seulontamenettely