sisäasiayhteistyö
type: Concept
scope note: Käytetään Euroopan unionin hallitusten väliseen yhteistyöhön liittyvänä terminä.Lissabonin sopimuksen jälkeen myös muussa EU-alueen yhteistyössä.
is member of: Euroopan unioin oikeus
is member of: Euroopan unioni
type: ey
type: ps4
type: ps3
date: 1995-01-04
preferred label: samarbete i inrikesärenden @sv
preferred label: EU cooperation in home affairs @en

Euroopan unioin oikeus
type: Collection
notation: 26
preferred label: Europeiska unionens rätt @sv
preferred label: Law of the European Union @en
preferred label: Euroopan unionin oikeus
member: sisäasiayhteistyö

Euroopan unioni
type: Collection
notation: 31
preferred label: Europeiska unionen @sv
preferred label: European Union @en
member: sisäasiayhteistyö