sosiaalinen vastuu
type: Concept
scope note: yrityksen sosiaalinen vastuu kattaa taloudellisen vastuullisuuden, ympäristövastuullisuuden ja sosiaalisen vastuullisuuden
is member of: Kauppa, teollisuus, kilpailu, kuluttajansuoja
type: eksuu04
date: 2004-09-29
alternative label: yrityksen yhteiskuntavastuu
alternative label: yrityksen sosiaalinen vastuu
preferred label: socialt ansvar @sv
preferred label: corporate social responsibility @en

Elinkeinoelämä
type: Collection
preferred label: Näringsliv @sv
preferred label: Industries @en
member: Kauppa, teollisuus, kilpailu, kuluttajansuoja

Kauppa, teollisuus, kilpailu, kuluttajansuoja
type: Collection
notation: 40.01
preferred label: Handel, industri, konkurrens, konsumentskydd @sv
preferred label: Trade, industry, competition, consumer protection @en
member: sosiaalinen vastuu