tulovero
type: Concept
preferred label: inkomstskatt @sv
preferred label: income tax @en

tulontasaus
type: Concept
source: muo
scope note: Käytetään vero-oikeudellisessa merkityksessä
is member of: Tulo- ja elinkeinoverotus sekä kunnallisvero
type: ps
related: tulovero
date: 1992-02-12
preferred label: inkomstutjämning @sv
preferred label: balancing of income @en

Vero- ja finanssioikeus
type: Collection
preferred label: Skatte- och finansrätt @sv
preferred label: Tax and financial law @en
member: Vero- ja finanssioikeus_s01

Vero- ja finanssioikeus_s01
type: Collection
member: Tulo- ja elinkeinoverotus sekä kunnallisvero

Tulo- ja elinkeinoverotus sekä kunnallisvero
type: Collection
notation: 22.01.02
preferred label: Inkomst- och näringsskatt samt kommunalskatt @sv
preferred label: Income and property tax and municipal tax @en
member: tulontasaus