nationalism
preferred label: nationalismi @fi
type: Concept

äktfinskhet
source: kir
scope note: Käytetään historiallisessa merkityksessä @fi
scope note: Used in a historical sense @en
is member of: Självständighetens tid
related: nationalism
date: 1990-01-02
preferred label: aitosuomalaisuus @fi
preferred label: Fenno-nationalism @en
type: Concept

Historia
preferred label: History @en
type: Collection
member: Finlands historia

Finlands historia
preferred label: Suomen historia @fi
preferred label: History of Finland @en
type: Collection
member: Självständighetens tid

Självständighetens tid
notation: 43.02.02
preferred label: Itsenäisyyden aika @fi
preferred label: Period of Finnish independence @en
type: Collection
member: äktfinskhet