elinkaari
scope note: Esimerkiksi tuotteiden, yrityksen tms. elinkaari
is member of: Kauppa, teollisuus, kilpailu, kuluttajansuoja
type: ps3
date: 1994-10-21
preferred label: livscykel @sv
preferred label: life cycle (products) @en
type: Concept

Elinkeinoelämä
preferred label: Näringsliv @sv
preferred label: Industries @en
type: Collection
member: Kauppa, teollisuus, kilpailu, kuluttajansuoja

Kauppa, teollisuus, kilpailu, kuluttajansuoja
notation: 40.01
preferred label: Handel, industri, konkurrens, konsumentskydd @sv
preferred label: Trade, industry, competition, consumer protection @en
type: Collection
member: elinkaari