yhteinen ulko- ja turvallisuuspolitiikka
preferred label: gemensam utrikes- och säkerhetspolitik @sv
preferred label: Common Foreign and Security Policy, CFSP @en
type: Concept

Euroopan turvallisuus- ja puolustusidentiteetti
scope note: Tavoitteena yhteistyön lisääminen Pohjois-Atlantin puolustusliiton kanssa
is member of: Euroopan yhteisöt
is member of: Ulkopolitiikka
type: eks98u
related: yhteinen ulko- ja turvallisuuspolitiikka
related: pohjois-atlantin-puolustusliitto
date: 1998-11-26
preferred label: Europeisk säkerhets- och försvarsidentitet @sv
preferred label: European security and defence identity, ESDI @en
type: Concept

Hallitusten väliset järjestöt
preferred label: Mellanstatliga organisationer @sv
preferred label: Intergovernmental organizations @en
type: Collection
member: Euroopan yhteisöt

Kansainvälinen politiikka
member: Hallitusten väliset järjestöt
member: Ulkopolitiikka
preferred label: Internationell politik @sv
preferred label: International politics @en
type: Collection

Euroopan yhteisöt
notation: 32.05.02
preferred label: European communities @en
preferred label: Europeiska gemenskaperna @sv
type: Collection
member: Euroopan turvallisuus- ja puolustusidentiteetti

Ulkopolitiikka
notation: 32.07
preferred label: Utrikespolitik @sv
preferred label: Foreign policy @en
type: Collection
member: Euroopan turvallisuus- ja puolustusidentiteetti