käräjät
source: muo
scope note: Käytetään historiallisessa merkityksessä
is member of: Oikeushistoria
type: ps
related: alioikeudet
date: 1992-01-20
preferred label: ting - domstol @sv
preferred label: court session @en
type: Concept

alioikeudet
preferred label: underrätter @sv
preferred label: courts of first instance @en
type: Concept
related: käräjät

Oikeushistoria
notation: 13
preferred label: Rättshistoria @sv
preferred label: History of law @en
type: Collection
member: käräjät