laina
source: muo
scope note: Irtaimen esineen vastikkeeton luovutus käytettäväksi
is member of: Esineoikeus
type: ps
date: 1992-01-23
preferred label: lån @sv
preferred label: loan @en
type: Concept

Siviilioikeus
preferred label: Civilrätt @sv
preferred label: Civil law @en
type: Collection
member: Esineoikeus

Esineoikeus
notation: 14.04
preferred label: Sakrätt @sv
preferred label: Law of property @en
type: Collection
member: laina