oikeusvertailu
source: muo
scope note: käytännöllisluonteista selvitystyötä, jossa vertaillaan kahden tai useamman maan säädöksiä
is member of: Kansainvälinen yksityisoikeus, yleistä
is member of: Oikeustiede yleensä, oikeusfilosofia, oikeussosiologia, oikeuspolitiikka ja vertaileva oikeustiede
type: ft
type: ps
related: vertaileva oikeustiede
date: 1992-01-20
preferred label: rättsjämförelse @sv
preferred label: comparative law @en
type: Concept

Kansainvälinen yksityisoikeus
preferred label: Internationell privaträtt @sv
preferred label: Private international law @en
type: Collection
member: Kansainvälinen yksityisoikeus, yleistä

vertaileva oikeustiede
preferred label: jämförande rättsvetenskap @sv
preferred label: comparative law @en
type: Concept
related: oikeusvertailu

Kansainvälinen yksityisoikeus, yleistä
notation: 25.01
preferred label: Internationell privaträtt, allmänt @sv
type: Collection
member: oikeusvertailu

Oikeustiede yleensä, oikeusfilosofia, oikeussosiologia, oikeuspolitiikka ja vertaileva oikeustiede
notation: 11
type: Collection
member: oikeusvertailu