Saksan kysymys
note: Ollut aiemmin eks:issä stx=e2.
scope note: käytetään historiallisessa merkityksessä
is member of: Euroopan ja maailmanhistoria
date: 1991-03-07
preferred label: Tyska frågan @sv
preferred label: German question @en
type: Concept

Historia
preferred label: History @en
type: Collection
member: Euroopan ja maailmanhistoria

Euroopan ja maailmanhistoria
notation: 43.03
preferred label: Europeiska och världshistoria @sv
preferred label: European and world history @en
type: Collection
member: Saksan kysymys