toisen asteen koulutus
modified: 2010-06-22
scope note: ammatillinen koulutus ja lukiokoulutus peruskoulun jälkeen
is member of: Koulu, koulutus- ja kulttuuripolitiikka
type: eksu06
related: keskiasteen koulutus
date: 2006-01-19
preferred label: andra stadiets utbildning @sv
preferred label: upper secondary education @en
type: Concept

Koulutus, tiede ja kulttuuri
preferred label: Utbildning, vetenskap och kultur @sv
preferred label: Education, science and culture @en
type: Collection
member: Koulu, koulutus- ja kulttuuripolitiikka

keskiasteen koulutus
preferred label: mellanstadieutbildning @sv
preferred label: secondary education @en
type: Concept
related: toisen asteen koulutus

Koulu, koulutus- ja kulttuuripolitiikka
notation: 38.01
preferred label: Skol, utbildnings- och kulturpolitik @sv
preferred label: School policy, educational and cultural policy @en
type: Collection
member: toisen asteen koulutus