trust
note: Selitystä muutettu 28.10.93
source: muo
scope note: käytetään common law-järjestelmään liittyvänä terminä
is member of: Oikeustiede yleensä, oikeusfilosofia, oikeussosiologia, oikeuspolitiikka ja vertaileva oikeustiede
type: ps
date: 1992-02-13
type: Concept

Oikeustiede yleensä, oikeusfilosofia, oikeussosiologia, oikeuspolitiikka ja vertaileva oikeustiede
notation: 11
type: Collection
member: trust