tunnustus
source: muo
scope note: Käytetään todistusoikeudellisessa merkityksessä
is member of: Todistusoikeus
type: ps
date: 1992-01-23
preferred label: bekännelse @sv
preferred label: confession @en
type: Concept

Prosessioikeus
preferred label: Processrätt @sv
preferred label: Procedural law @en
type: Collection
member: Todistusoikeus

Todistusoikeus
notation: 19.04
preferred label: Bevisrätt @sv
preferred label: Law of evidence @en
type: Collection
member: tunnustus