vahvistus (pätevyyden antaminen)
in scheme: conceptscheme
source: Kielitoimiston sanakirja
preferred label: stadfästelse @sv
preferred label: confirmation (validity) @en
broader: toisenlaiseksi muuttaminen
alternative label: vahvistus
comment: antaa jllek toimenpiteelle, päätökselle, määräykselle tms. laillinen, täysi pätevyys, sanktioida; määrätä t. lopullisesti hyväksyä virallisesti noudatettavaksi
type: Concept

toisenlaiseksi muuttaminen
preferred label: förvandling @sv
preferred label: alteration @en
type: Concept
narrower: vahvistus (pätevyyden antaminen)