vesipiirit (hallintoalueet)
comment: Vuosina 1970-86 vesihallinnon alueyksiköiden nimitys. Nykyään EU:n puitedirektiivin mukainen maa- ja vesialue, joka koostuu yhdestä tai useasta läheisestä vesistöalueesta yhdessä niihin yhteydessä olevien pohjavesien ja rannikkovesien kanssa ja joka on määritelty perusyksiköksi vesistöalueiden hoitoa varten
related: vesi- ja ympäristöpiirit (hallintoalueet)
related: vesistöalueet
source: Lähde: EnDic2000
alternative label: vesipiirit
scope note: Vuosina 1970-86 vesihallinnon alueyksiköiden nimitys. 1.9.1986 vesipiireistä tuli vesi- ja ympäristöpiirejä
scope note: Termen användes under åren 1970-86. Från och med 1.9.1986 används termen vatten- och miljödistrikt. @sv
preferred label: water districts (administrative areas) @en
preferred label: vattendistrikt @sv
type: Concept
broader: hallinnollinen piiri (hallintoalueet)
in scheme: conceptscheme

hallinnollinen piiri (hallintoalueet)
preferred label: administrative district (administrative areas) @en
type: Concept
narrower: vesipiirit (hallintoalueet)

vesi- ja ympäristöpiirit (hallintoalueet)
preferred label: water and environment districts (administrative districts) @en
preferred label: vatten- och miljödistrikt @sv
type: Concept
related: vesipiirit (hallintoalueet)

vesistöalueet
preferred label: watersystems @en
preferred label: flodområden @sv
type: Concept
related: vesipiirit (hallintoalueet)