ekotehokkuus
scope note: Tarkoittaa tuotannon ja toiminnan tehokkuutta mahdollisimman vähäisin ympäristövaikutuksin
preferred label: ecoefficiency @en
preferred label: ekoeffektivitet @sv
type: Concept
in scheme: conceptscheme
related: MIPS
alternative label: materiaalitehokkuus
alternative label: miljöeffektivitet @sv
alternative label: ympäristötehokkuus
broader: tehokkuus

MIPS
type: Concept
related: ekotehokkuus

tehokkuus
preferred label: efficacy @en
preferred label: effektivitet @sv
type: Concept
narrower: ekotehokkuus