vahvistus (pätevyyden antaminen)
type: Concept
source: Kielitoimiston sanakirja
preferred label: stadfästelse @sv
preferred label: confirmation (validity) @en
broader: toisenlaiseksi muuttaminen
alternative label: vahvistus
comment: antaa jllek toimenpiteelle, päätökselle, määräykselle tms. laillinen, täysi pätevyys, sanktioida; määrätä t. lopullisesti hyväksyä virallisesti noudatettavaksi
in scheme: conceptscheme

toisenlaiseksi muuttaminen
type: Concept
preferred label: förvandling @sv
preferred label: alteration @en
narrower: vahvistus (pätevyyden antaminen)

vahvistaminen
type: Concept