subject

päätökset
preferred label: decisions @en
preferred label: beslut @sv
type: Concept
narrower: lainhuudot

päätökset
type: Concept
narrower: lainhuudot

lainhuudot
subject: kaavat ja kiinteistöt
broader: päätökset
source: JHS
comment: lainhuudatusasiassa annettu omistusoikeuden turvaava päätös [Suomen kielen perussanakirja]
in scheme: conceptscheme
type: Concept