dikter
preferred label: runot @fi
preferred label: poems @en
type: Concept
narrower: pastoraler

pastoraler
source: Kielitoimiston sanakirja
broader: dikter
preferred label: pastorals @en
preferred label: pastoraalit (runot) @fi
comment: paimenrunouden aiheista kirjoitettu musiikkia ja balettia sisältävä näytelmä, paimennäytelmä; paimenruno
type: Concept
in scheme: conceptscheme