tunniste
label: identifierare @sv

hypotermia
type: Concept
source: Kielitoimiston sanakirja
comment: fysiol. normaalia matalampi ruumiinlämpö; elimistön lämpötilan laskeminen (esim. leikkausta varten); vajaalämpöisyys.
alternative label: nedsatt kroppstemperatur @sv
alternative label: vajaalämpöisyys
alternative label: sänkt kroppstemperatur @sv
alternative label: alilämpöisyys
in scheme: conceptscheme
preferred label: hypotermi @sv
top concept of: conceptscheme
candidate: 0
facet: section 1
hide in public side: 0 @sv
tunniste: 46543

hypotermia
type: Concept
preferred label: hypotermi @sv