identifierare
label: tunniste @fi

läroämnen
type: Concept
source: Verkko-Kaunokki @fi
source: Webb-Bella
comment: Namnen på alla läroämnen kan användas som ämnesord.
comment: Kaikkien oppiaineiden nimiä voi käyttää asiasanoina. @fi
broader: kunskap
in scheme: conceptscheme
preferred label: oppiaineet @fi
candidate: 0
facet: section 1
hide in public side: 0
identifierare: 42899

kunskap
type: Concept
narrower: läroämnen
preferred label: tieto @fi

läroämnen
type: Concept
preferred label: curriculum subjects @en
preferred label: oppiaineet @fi