tunniste
label: identifierare @sv

deus ex machina
type: Concept
source: Otavan kirjallisuustieto
comment: lat. "jumala koneesta", odottamaton apu, äkillinen pelastaja, erityisesti yllättävä monimutkaisen tai solmuun menneen juonen loppuratkaisu
broader: kulttuuriset tuotokset
in scheme: conceptscheme
candidate: 0
facet: section 1
hide in public side: 0 @sv
tunniste: 47104

kulttuuriset tuotokset
type: Concept
narrower: deus ex machina