tunniste
label: identifierare @sv

ikiliikkujat
type: Concept
source: Kielitoimiston sanakirja
comment: kuviteltu laite, joka suorittaisi jatkuvasti mekaanista työtä ilman energianlähdettä t. muuttaisi lämpöenergiaa 100-prosenttisesti mekaaniseksi energiaksi. Kuv. aktiivisesta liikkujasta, menevästä ihmisestä tms.
in scheme: conceptscheme
preferred label: perpetuum mobile @sv
related: keksinnöt
top concept of: conceptscheme
candidate: 0
facet: section 1
hide in public side: 0 @sv
tunniste: 43160

keksinnöt
type: Concept
preferred label: uppfinningar @sv
related: ikiliikkujat

ikiliikkujat
type: Concept
preferred label: perpetuum mobile @sv