tunniste
label: identifierare @sv

agentit
type: Concept
source: Suomen kielen perussanakirja.
comment: 1) asiamies, edustaja; 2) salaisen palvelun asiamies, vakooja; 3) (kiel.) eräs teon suorittajan ilmaiseva lauseenjäsen.
in scheme: conceptscheme
preferred label: agenter @sv
related: vakoilijat
top concept of: conceptscheme
candidate: 0
facet: section 6
hide in public side: 0 @sv
tunniste: 44412

vakoilijat
type: Concept
preferred label: spioner @sv
related: agentit

agentit
type: Concept
preferred label: agents @en
preferred label: agenter @sv