tunniste
label: identifierare @sv

vaihdevuodet
type: Concept
preferred label: klimakteriet @sv
related: andropaussi

andropaussi
type: Concept
source: Kielitoimiston sanakirja
comment: lääk. ikääntyvän miehen oireisto, johon kuuluvat mm. sukupuolisen halun väheneminen, erektiohäiriöt ja lihasvoiman heikkeneminen ja jonka on arveltu liittyvän mieshormonituotannon vähenemiseen.
broader: biologiset ilmiöt
in scheme: conceptscheme
preferred label: andropaus @sv
related: vaihdevuodet
candidate: 0
facet: section 1
hide in public side: 0 @sv
tunniste: 49012

biologiset ilmiöt
type: Concept
narrower: andropaussi