identifierare
label: tunniste @fi

dikter
type: Concept
narrower: elegier
preferred label: runot @fi

elegier
type: Concept
source: Nationalencyklopedin
source: Yrjö Hosiaisluoma: Kirjallisuuden sanakirja @fi
comment: klagosång, sorgekväde, t.ex. över en avliden; ursprungligen ett antikt versmått.
comment: Antiikin aikana elegiseen runomittaan laadittu runoelma, useimmiten hauta-, muisto- tai omistuskirjoitus; sittemmin yleensä runo, jolla on melankolinen pohjasävy. @fi
broader: dikter
in scheme: conceptscheme
preferred label: elegiat @fi
candidate: 0
facet: section 3
hide in public side: 0
identifierare: 44125

elegier
type: Concept
preferred label: elegies @en
preferred label: elegiat @fi