antropomorfismi
type: Concept
source: Verkko-Kaunokki
comment: Tarkoittaa inhimillisten ominaisuuksien siirtämistä muihin elollisiin olentoihin tai elottomiin kappaleisiin. Uskonnossa tarkoittaa jumalien ihmisenkaltaisuutta.
alternative label: ihmisenkaltaistaminen
alternative label: inhimillistäminen
broader: toisenlaiseksi muuttaminen
in scheme: conceptscheme
preferred label: antropomorfism @sv
facet: section 1

toisenlaiseksi muuttaminen
type: Concept
narrower: antropomorfismi